View Single Post
Old 22 January 2005, 05:53 pm   #2
Senior Member
kuniklo's Avatar
Join Date: Aug 2004
Location: Emeryville, CA
Posts: 52
Default Re: problem compiling xmms-musepack /usr/lib/ ..

I can īt compile xmms-musepack 1.1.1

this is the error:

/usr/lib/ could not read symbols: Invalid operation

collect2: ld returned 1 exit status

make[2]: *** [] Error 1

make[2]: Leaving directory `/home/cristian/xmms-musepack-1.1.1/src'

make[1]: *** [all] Error 2

make[1]: Leaving directory `/home/cristian/xmms-musepack-1.1.1/src'

make: *** [all-recursive] Error 1

Im using SUSE 9.2 X86_64

Strange error. You might want to wait for a day or two. New versions of libmusepack and the plugins are imminent.
kuniklo is offline   Reply With Quote