View Single Post
Old 27 April 2005, 06:21 pm   #1
Exekutor
Member
 
Join Date: Apr 2005
Posts: 1
Default Problem Compiling BMP Plugin on Ubuntu

I've compiled and installed libmusepack-1.1.1 without any errors.

The configuration process for bmp-musepack-1.1.2 was ok, but when compilig, gives the error:

Code:
libmpc.cpp:37: error: parse error before `*' token
libmpc.cpp:61: error: parse error before `*' token
libmpc.cpp:70: error: type specifier omitted for parameter `BOOL'
libmpc.cpp:70: error: parse error before `)' token
libmpc.cpp: In function `void setup_reader(...)':
libmpc.cpp:72: error: `data' undeclared (first use this function)
libmpc.cpp:72: error: (Each undeclared identifier is reported only once for
   each function it appears in.)
libmpc.cpp:72: error: `input' undeclared (first use this function)
libmpc.cpp:73: error: `seekable' undeclared (first use this function)
libmpc.cpp:78: error: `reader' undeclared (first use this function)
libmpc.cpp:80: error: `seek_impl' undeclared (first use this function)
libmpc.cpp:83: error: `canseek_impl' undeclared (first use this function)
make[2]: *** [libmpc.lo] Error 1
make[2]: Leaving directory `/home/cristobal/musepack/bmp-musepack-1.1.2/src'
make[1]: *** [all] Error 2
make[1]: Leaving directory `/home/cristobal/musepack/bmp-musepack-1.1.2/src'
make: *** [all-recursive] Error 1
Maybe the version of the pluguin (i'm using the 1.1.2) requires the same version of libmusepack (i'm using the 1.1.1), but on the download page those are available only.

Or maybe a dependency problem?.
Exekutor is offline   Reply With Quote